{"text_format":"1","workbook":"xlsx","n_sheets":8,"sheets":["Instructions","Current CN Bud Info","Req Chng Overall CN Bud","Req Chng Disb Fnds Realignment","Req Chng Auth Expend Spread","Final Bud Form Part II","Final Bud Form Part I","LOCCS Form"],"not_rendered":{"charts":0,"images":0,"macros":1,"external_links":0,"defined_names":9,"comments":5,"pivot_tables":0},"unopened":[],"bounds":{"document_bytes":16777216,"sheet_cells":100000,"rows_first":2000,"rows_last":500,"rows_between":2000,"halvings":0,"cell_chars":16384,"cell_head_chars":4096},"cells_cut":0,"cells_raw":0,"read":"whole","date_system":"1900"}

{"sheet":"Instructions","index":0,"n_rows":40,"n_cols":10,"rows_kept":40,"cut":false,"hidden":false,"merged":[]}
[]
[]
[]
[]
[]
[]
[]
[]
[]
[]
[]
[]
[]
[]
[]
[]
[]
[]
[]
[]
{"$rows_left_out":21}
{"sheet":"Current CN Bud Info","index":1,"n_rows":24,"n_cols":7,"rows_kept":24,"cut":false,"hidden":false,"merged":[[4,3,4,5],[1,3,1,5],[2,3,2,5],[3,3,3,5],[0,1,0,6]]}
[null,"Current CN Budget Information  "]
[null,"Grant Number",null,"Date of Submission of this Budget Request"]
[null,"Grantee",null,"This Request is for Budget Revision Number"]
[null,"Devel. Name",null,"Date of Most Recent Prior HUD Approved Budget Revision"]
[null,"Prepared by:",null,"HUD Grant Manager:"]
[null,"Line No.","Summary by Budget Line Item","Budget Line Item","Current Overall\nCN Budget \nfor All Project Phases","Current Disbursed\nAmount shown in LOCCS","Current Authorized (Spread)\nAmount in LOCCS"]
[null,1,"Supportive Services",1405,0,0,0]
[null,2,"Management Improvements",1408,0,0,0]
[null,3,"Evaluation",1409,0,0,0]
[null,4,"Administration",1410,0,0,0]
[null,5,"Fees and Costs",1430,0,0,0]
[null,6,"Site Acquisition",1440,0,0,0]
[null,7,"Site Improvement",1450,0,0,0]
[null,8,"Dwelling Structures",1460,0,0,0]
[null,9,"Dwelling Equipment-Nonexpendable",1465,0,0,0]
[null,10,"Nondwelling Structures",1470,0,0,0]
[null,11,"Nondwelling Equipment",1475,0,0,0]
[null,12,"Critical Community Improvements",1480,0,0,0]
[null,13,"Demolition",1485,0,0,0]
[null,14,"Relocation Costs",1495,0,0,0]
{"$rows_left_out":5}
{"sheet":"Req Chng Overall CN Bud","index":2,"n_rows":33,"n_cols":13,"rows_kept":33,"cut":false,"hidden":false,"merged":[[13,1,13,2],[1,1,1,5],[2,1,2,5],[0,1,0,5],[13,9,13,10],[0,9,0,12],[1,9,1,12],[2,9,2,12],[3,9,3,12],[4,9,4,12]]}
[]
[]
[]
[null,null,null,null,null,null,null,null,null,"Requested Change in Overall Budget"]
[null,null,null,null,null,null,null,null,null," (table for HUD approval letter)"]
[]
[]
[]
[]
[]
[]
[]
[null,null,null,null,null,null,null,null,null,"Re: Overall HOPE VI Budget Revision"]
[null,null,null,null,null,null,null,null,null,"HOPE VI Grant Num:",null,{"$f":"'Current CN Bud Info'!N2","v":0}]
[]
[]
[null,null,"Budget Line Item","Current Overall\nCN Budget","Amount Moved Between Budget Line Items","Revised Overall\nCN Budget",null,null,null,{"$f":"C17","v":"Budget Line Item"},{"$f":"D17","v":"Current Overall\nCN Budget"},{"$f":"E17","v":"Amount Moved Between Budget Line Items"},{"$f":"F17","v":"Revised Overall\nCN Budget"}]
[null,1,1405,{"$f":"'Current CN Bud Info'!E7","v":0},null,{"$f":"D18+E18","v":0},null,null,null,{"$f":"C18","v":1405},{"$f":"D18","v":0},{"$f":"E18","v":0},{"$f":"F18","v":0}]
[null,2,1408,{"$f":"'Current CN Bud Info'!E8","v":0},null,{"$f":"D19+E19","v":0},null,null,null,1408,0,0,0]
[null,3,1409,{"$f":"'Current CN Bud Info'!E9","v":0},null,{"$f":"D20+E20","v":0},null,null,null,1409,0,0,0]
{"$rows_left_out":14}
{"sheet":"Req Chng Disb Fnds Realignment","index":3,"n_rows":39,"n_cols":17,"rows_kept":39,"cut":false,"hidden":false,"merged":[[13,13,13,14],[0,1,0,4],[1,1,1,4],[2,1,2,4],[13,1,13,2],[0,13,0,16],[1,13,1,16],[2,13,2,16]]}
[null,null,null,null,null,null,null,null,null,null,null,null,null,"LOCCS REALIGNMENT"]
[null,null,null,null,null,null,null,null,null,null,null,null,null,"Request to Realign Distributions"]
[null,null,null,null,null,null,null,null,null,null,null,null,null,{"$f":"TODAY()","v":"2022-10-25"}]
[]
[]
[]
[null,null,null,null,null,null,null,null,null,null,null,null,null,"Memorandum For:  OPHI LOCCS Administrator"]
[]
[]
[null,null,null,null,null,null,null,null,null,null,null,null,null,"From: ",{"$f":"'Current CN Bud Info'!$G$5","v":0}]
[]
[]
[null,null,null,null,null,null,null,null,null,null,null,null,null,"Re: Realignment of Distributions"]
[null,null,null,null,null,null,null,null,null,null,null,null,null,"       CN Grant Number:",null,{"$f":"'Current CN Bud Info'!C2","v":0}]
[null,null,null,null,null,null,null,null,null,null,null,null,null,null,"Budget Revision Num:",{"$f":"'Current CN Bud Info'!G3","v":0}]
[]
[]
[]
[null,"BLI","Current LOCCS\nExpenditures","Increase / Decrease","Revised LOCCS\nExpenditures","Is a Spread Increase Needed?",null,null,null,null,null,null,null,"BLI","Current LOCCS\nExpenditures","Increase/Decrease","Revised LOCCS\nExpenditures"]
[null,1405,{"$f":"'Current CN Bud Info'!F7","v":0},null,{"$f":"D20+C20","v":0},{"$f":"IF(D20=\"\",\"\",IF(E20<0,\"Must be At Leaset Zero Dollars\",IF(E20>'Current CN Bud Info'!G7,\"Spread Increase IS Needed!\",\"NOT Needed.\")))","v":""},null,null,null,null,null,null,null,{"$f":"B20","v":1405},{"$f":"C20","v":0},{"$f":"D20","v":0},{"$f":"E20","v":0}]
{"$rows_left_out":20}
{"sheet":"Req Chng Auth Expend Spread","index":4,"n_rows":49,"n_cols":15,"rows_kept":49,"cut":false,"hidden":false,"merged":[]}
[]
[]
[]
[]
[]
[]
[]
[]
[]
[]
[]
[]
[]
[]
[]
[]
[null,"BLI","Requested\nOverall CN Budget","Current Spread","Increase / Decrease\nin Spread","Revised Spread","Does your spread cover your disbursements?\nIs it within your budget?",null,null,null,"BLI","Approved\nOverall CN Budget","Current Spread","Increase/Decrease\nin Spread","Revised Spread"]
[null,1405,{"$f":"'Req Chng Overall CN Bud'!F18","v":0},{"$f":"'Current CN Bud Info'!G7","v":0},0,{"$f":"D18+E18","v":0},{"$f":"IF(F18<'Req Chng Disb Fnds Realignment'!E20,\"Your Spread does not cover your Disbursements! Spread Increase Needed!\",(IF(F18>C18,\"  Your BLI Budget Does NOT Cover Your Spread! Budget Update Needed.\",\"\")))","v":""},null,null,null,{"$f":"B18","v":1405},{"$f":"C18","v":0},{"$f":"D18","v":0},{"$f":"E18","v":0},{"$f":"F18","v":0}]
[null,1408,{"$f":"'Req Chng Overall CN Bud'!F19","v":0},{"$f":"'Current CN Bud Info'!G8","v":0},0,{"$f":"D19+E19","v":0},{"$f":"IF(F19<'Req Chng Disb Fnds Realignment'!E21,\"Your Spread does not cover your Disbursements! Spread Increase Needed!\",(IF(F19>C19,\"  Your BLI Budget Does NOT Cover Your Spread! Budget Update Needed.\",\"\")))","v":""},null,null,null,{"$f":"B19","v":1408},{"$f":"C19","v":0},{"$f":"D19","v":0},{"$f":"E19","v":0},{"$f":"F19","v":0}]
[null,1409,{"$f":"'Req Chng Overall CN Bud'!F20","v":0},{"$f":"'Current CN Bud Info'!G9","v":0},0,{"$f":"D20+E20","v":0},{"$f":"IF(F20<'Req Chng Disb Fnds Realignment'!E22,\"Your Spread does not cover your Disbursements! Spread Increase Needed!\",(IF(F20>C20,\"  Your BLI Budget Does NOT Cover Your Spread! Budget Update Needed.\",\"\")))","v":""},null,null,null,{"$f":"B20","v":1409},{"$f":"C20","v":0},{"$f":"D20","v":0},{"$f":"E20","v":0},{"$f":"F20","v":0}]
{"$rows_left_out":30}
{"sheet":"Final Bud Form Part II","index":5,"n_rows":276,"n_cols":20,"rows_kept":276,"cut":false,"hidden":false,"merged":[[268,0,269,0],[206,0,207,0],[224,0,225,0],[238,0,239,0],[253,0,254,0],[191,0,192,0],[176,0,177,0],[19,0,20,0],[34,0,35,0],[49,0,50,0],[69,0,70,0],[116,0,117,0],[131,0,132,0],[146,0,147,0],[161,0,162,0],[1,6,1,7],[2,6,2,7],[1,4,1,5],[2,4,2,5],[7,1,7,4],[1,1,1,3],[2,1,2,3],[24,1,24,4],[39,1,39,4],[181,1,181,4],[54,1,54,4],[258,1,258,4],[196,1,196,4],[211,1,211,4],[229,1,229,4],[243,1,243,4]]}
[]
[null,{"$f":"CONCATENATE(\"GRANTEE:  \",'Current CN Bud Info'!C3)","v":"GRANTEE:  "},null,null,"Budget Revision Number",null,"Grant Number"]
[null,{"$f":"CONCATENATE(\"Development Name:  \",'Current CN Bud Info'!C4)","v":"Development Name:  "},null,null,{"$f":"'Current CN Bud Info'!G3","v":0},null,{"$f":"'Current CN Bud Info'!$C$2","v":0}]
[]
["Budget Line Item Number","Description of Proposed/Approved Action\nUse of Additional Authorized Funds","Current Overall CN Budget","Requested Change in Overall CN Budget","Requested Change in Disbursed Funds (Realignment)","Current Authorized Amount \n(Current Spread)","Requested Change in Amount Authorized for Expenditure (Change in Spread)","Total Funds to be Authorized for Expenditure\n(New Spread)"]
[1,2,3,4,5,6,7,8]
[]
[1405,"SUPPORTIVE SERVICES",null,null,null,null,null,null,null,null,null,null,null,null,null,"new total budget","diff betw new total budget and total spread"]
[null,null,null,null,null,null,null,{"$f":"G9+F9","v":0},null,null,null,null,null,null,null,{"$f":"C9+D9","v":0},{"$f":"P9-H9","v":0}]
[null,null,null,null,null,null,null,{"$f":"G10+F10","v":0},null,null,null,null,null,null,null,0,0]
[null,null,null,null,null,null,null,{"$f":"G11+F11","v":0},null,null,null,null,null,null,null,0,0]
[null,null,null,null,null,null,null,0,null,null,null,null,null,null,null,0,0]
[null,null,null,null,null,null,null,0,null,null,null,null,null,null,null,0,0]
[null,null,null,null,null,null,null,0,null,null,null,null,null,null,null,0,0]
[null,null,null,null,null,null,null,0,null,null,null,null,null,null,null,0,0]
[null,null,null,null,null,null,null,0,null,null,null,null,null,null,null,0,0]
[null,null,null,null,null,null,null,0,null,null,null,null,null,null,null,0,0]
[null,null,null,null,null,null,null,0,null,null,null,null,null,null,null,0,0]
[null,null,null,null,null,null,null,0,null,null,null,null,null,null,null,0,0]
[null,"Total Changes",null,{"$f":"SUM(D9:D19)","v":0},{"$f":"SUM(E9:E19)","v":0},null,{"$f":"SUM(G9:G19)","v":0}]
{"$rows_left_out":257}
{"sheet":"Final Bud Form Part I","index":6,"n_rows":45,"n_cols":9,"rows_kept":45,"cut":false,"hidden":false,"merged":[[0,3,0,4],[1,3,1,4],[14,0,14,1],[15,0,15,1]]}
["Choice Neighborhoods Budget",null,null,"U. S. Department of Housing\nand Urban Development"]
["Implementation Grants",null,null,"Office of Public and Indian Housing",null,null,"OMB Approval No.  2577-0269"]
["Part I: Summary",null,null,null,null,null," (exp. 3/31/2025)"]
[]
[]
[]
[]
[]
[]
[]
[]
[]
[]
[]
["Grantee Name:",null,{"$f":"'Current CN Bud Info'!C3","v":0},null,"CN Grant Number:",{"$f":"'Current CN Bud Info'!C2","v":0}]
["Devel. Name:",null,{"$f":"'Current CN Bud Info'!C4","v":0},null,"Budget Revision Number:",{"$f":"'Current CN Bud Info'!G3","v":0}]
[]
[]
["Line No.",null,"Summary by Budget Line Item","Revised Overall \nCN Budget \nfor All Project Phases","Previous Amount of Funds \nAuthorized for Expenditure","\nChanges Requested \nin this Revision","HUD-Approved Total Amount of Funds Authorized for Expenditure"]
[1,1405,"Supportive Service",{"$f":"'Req Chng Overall CN Bud'!F18","v":0},{"$f":"'Current CN Bud Info'!G7","v":0},{"$f":"'Req Chng Auth Expend Spread'!E18","v":0},{"$f":"'Req Chng Auth Expend Spread'!$F18","v":0},null,{"$f":"'Req Chng Auth Expend Spread'!$F18","v":0}]
{"$rows_left_out":26}
{"sheet":"LOCCS Form","index":7,"n_rows":33,"n_cols":12,"rows_kept":33,"cut":false,"hidden":false,"merged":[[10,1,10,3],[10,5,10,7],[10,9,10,11],[3,1,3,3],[5,3,5,5],[5,0,5,2],[6,0,6,2]]}
["Memorandum For:  OPHI LOCCS Administrator"]
[]
[]
["From: ",{"$f":"'Current CN Bud Info'!G5","v":0}]
[]
["Re: Choice Neighborhoods Grant No:",null,null,{"$f":"'Current CN Bud Info'!C2","v":0}]
["Budget Revision Num:",null,null,{"$f":"'Current CN Bud Info'!G3","v":0}]
[]
["Please make the following changes in LOCCS for the subject grant."]
[]
[null,"OVERALL CN BUDGET",null,null,null,"REALIGNMENT OF EXPENDITURES",null,null,null,"CHANGE IN SPREAD"]
["BLI",{"$f":"'Current CN Bud Info'!E6","v":"Current Overall\nCN Budget \nfor All Project Phases"},"Increase/ Decrease",{"$f":"'Req Chng Overall CN Bud'!F17","v":"Revised Overall\nCN Budget"},"BLI",{"$f":"'Req Chng Disb Fnds Realignment'!C19","v":"Current LOCCS\nExpenditures"},{"$f":"'Req Chng Disb Fnds Realignment'!D19","v":"Increase / Decrease"},{"$f":"'Req Chng Disb Fnds Realignment'!E19","v":"Revised LOCCS\nExpenditures"},"BLI",{"$f":"'Req Chng Auth Expend Spread'!D17","v":"Current Spread"},{"$f":"'Req Chng Auth Expend Spread'!E17","v":"Increase / Decrease\nin Spread"},{"$f":"'Req Chng Auth Expend Spread'!F17","v":"Revised Spread"}]
[1405,{"$f":"'Current CN Bud Info'!E7","v":0},{"$f":"'Req Chng Overall CN Bud'!E18","v":0},{"$f":"'Req Chng Overall CN Bud'!F18","v":0},1405,{"$f":"'Req Chng Disb Fnds Realignment'!C20","v":0},{"$f":"'Req Chng Disb Fnds Realignment'!D20","v":0},{"$f":"'Req Chng Disb Fnds Realignment'!E20","v":0},1405,{"$f":"'Req Chng Auth Expend Spread'!D18","v":0},{"$f":"'Req Chng Auth Expend Spread'!E18","v":0},{"$f":"'Req Chng Auth Expend Spread'!F18","v":0}]
[1408,{"$f":"'Current CN Bud Info'!E8","v":0},{"$f":"'Req Chng Overall CN Bud'!E19","v":0},{"$f":"'Req Chng Overall CN Bud'!F19","v":0},1408,{"$f":"'Req Chng Disb Fnds Realignment'!C21","v":0},{"$f":"'Req Chng Disb Fnds Realignment'!D21","v":0},{"$f":"'Req Chng Disb Fnds Realignment'!E21","v":0},1408,{"$f":"'Req Chng Auth Expend Spread'!D19","v":0},{"$f":"'Req Chng Auth Expend Spread'!E19","v":0},{"$f":"'Req Chng Auth Expend Spread'!F19","v":0}]
[1409,{"$f":"'Current CN Bud Info'!E9","v":0},{"$f":"'Req Chng Overall CN Bud'!E20","v":0},{"$f":"'Req Chng Overall CN Bud'!F20","v":0},1409,{"$f":"'Req Chng Disb Fnds Realignment'!C22","v":0},{"$f":"'Req Chng Disb Fnds Realignment'!D22","v":0},{"$f":"'Req Chng Disb Fnds Realignment'!E22","v":0},1409,{"$f":"'Req Chng Auth Expend Spread'!D20","v":0},{"$f":"'Req Chng Auth Expend Spread'!E20","v":0},{"$f":"'Req Chng Auth Expend Spread'!F20","v":0}]
[1410,{"$f":"'Current CN Bud Info'!E10","v":0},{"$f":"'Req Chng Overall CN Bud'!E21","v":0},{"$f":"'Req Chng Overall CN Bud'!F21","v":0},1410,{"$f":"'Req Chng Disb Fnds Realignment'!C23","v":0},{"$f":"'Req Chng Disb Fnds Realignment'!D23","v":0},{"$f":"'Req Chng Disb Fnds Realignment'!E23","v":0},1410,{"$f":"'Req Chng Auth Expend Spread'!D21","v":0},{"$f":"'Req Chng Auth Expend Spread'!E21","v":0},{"$f":"'Req Chng Auth Expend Spread'!F21","v":0}]
[1430,{"$f":"'Current CN Bud Info'!E11","v":0},{"$f":"'Req Chng Overall CN Bud'!E22","v":0},{"$f":"'Req Chng Overall CN Bud'!F22","v":0},1430,{"$f":"'Req Chng Disb Fnds Realignment'!C24","v":0},{"$f":"'Req Chng Disb Fnds Realignment'!D24","v":0},{"$f":"'Req Chng Disb Fnds Realignment'!E24","v":0},1430,{"$f":"'Req Chng Auth Expend Spread'!D22","v":0},{"$f":"'Req Chng Auth Expend Spread'!E22","v":0},{"$f":"'Req Chng Auth Expend Spread'!F22","v":0}]
[1440,{"$f":"'Current CN Bud Info'!E12","v":0},{"$f":"'Req Chng Overall CN Bud'!E23","v":0},{"$f":"'Req Chng Overall CN Bud'!F23","v":0},1440,{"$f":"'Req Chng Disb Fnds Realignment'!C25","v":0},{"$f":"'Req Chng Disb Fnds Realignment'!D25","v":0},{"$f":"'Req Chng Disb Fnds Realignment'!E25","v":0},1440,{"$f":"'Req Chng Auth Expend Spread'!D23","v":0},{"$f":"'Req Chng Auth Expend Spread'!E23","v":0},{"$f":"'Req Chng Auth Expend Spread'!F23","v":0}]
[1450,{"$f":"'Current CN Bud Info'!E13","v":0},{"$f":"'Req Chng Overall CN Bud'!E24","v":0},{"$f":"'Req Chng Overall CN Bud'!F24","v":0},1450,{"$f":"'Req Chng Disb Fnds Realignment'!C26","v":0},{"$f":"'Req Chng Disb Fnds Realignment'!D26","v":0},{"$f":"'Req Chng Disb Fnds Realignment'!E26","v":0},1450,{"$f":"'Req Chng Auth Expend Spread'!D24","v":0},{"$f":"'Req Chng Auth Expend Spread'!E24","v":0},{"$f":"'Req Chng Auth Expend Spread'!F24","v":0}]
[1460,{"$f":"'Current CN Bud Info'!E14","v":0},{"$f":"'Req Chng Overall CN Bud'!E25","v":0},{"$f":"'Req Chng Overall CN Bud'!F25","v":0},1460,{"$f":"'Req Chng Disb Fnds Realignment'!C27","v":0},{"$f":"'Req Chng Disb Fnds Realignment'!D27","v":0},{"$f":"'Req Chng Disb Fnds Realignment'!E27","v":0},1460,{"$f":"'Req Chng Auth Expend Spread'!D25","v":0},{"$f":"'Req Chng Auth Expend Spread'!E25","v":0},{"$f":"'Req Chng Auth Expend Spread'!F25","v":0}]
{"$rows_left_out":13}